Reaction Details
TargetDipeptidyl peptidase 2
LigandBDBM50050513
Substrate/Competitorn/a
Meas. Tech.ChEMBL_53369 (CHEMBL666615)
Ki 125000±n/a nM
Citation Senten, KVan der Veken, PDe Meester, ILambeir, AMScharpé, SHaemers, AAugustyns, K Design, synthesis, and SAR of potent and selective dipeptide-derived inhibitors for dipeptidyl peptidases. J Med Chem46:5005-14 (2003) 
 
Dipeptidyl peptidase 2
Name:Dipeptidyl peptidase 2
Type:Protein
Mol. Mass.:54339.29
Organism:Homo sapiens (Human)
Description:Q9UHL4
Residue:492
BDBM50050513
NameBDBM50050513
Synonyms:(R)-1-((S)-2-amino-3-methylbutanoyl)pyrrolidin-2-ylboronic acid (S)-2-Amino-3-methyl-2-boronic acid-1-pyrrolidin-1-yl-butan-1-one CHEMBL67279 Pyrrolidine derivative US11504364, Compound Val-boroPro US11707539, Compound 2054
TypeSmall organic molecule
Emp. Form.C9H19BN2O3
Mol. Mass.214.07
SMILESCC(C)[C@H](N)C(=O)N1CCC[C@H]1B(O)O