Reaction Details
TargetHistone deacetylase 4
LigandBDBM50105695
Substrate/Competitorn/a
Meas. Tech.ChEMBL_207282 (CHEMBL811365)
EC50>25000±n/a nM
Citation Miller, TAWitter, DJBelvedere, S Histone deacetylase inhibitors. J Med Chem46:5097-116 (2003) 
 
Histone deacetylase 4
Name:Histone deacetylase 4
Type:Enzyme
Mol. Mass.:119049.39
Organism:Homo sapiens (Human)
Description:P56524
Residue:1084
BDBM50105695
NameBDBM50105695
Synonyms:(E)-3-(4-Benzenesulfonylamino-phenyl)-N-hydroxy-2-methyl-acrylamide CHEMBL100035 US8796330, 91
TypeSmall organic molecule
Emp. Form.C16H16N2O4S
Mol. Mass.332.374
SMILESC\C(=C/c1ccc(NS(=O)(=O)c2ccccc2)cc1)C(=O)NO