Reaction Details
TargetHistone deacetylase
LigandBDBM50135767
Substrate/Competitorn/a
Meas. Tech.ChEMBL_87394 (CHEMBL691509)
IC50 0.8±n/a nM
Citation Miller, TAWitter, DJBelvedere, S Histone deacetylase inhibitors. J Med Chem46:5097-116 (2003) 
 
Histone deacetylase
Name:Histone deacetylase
Synonyms:n/a
Type:PROTEIN
Mol. Mass.:50433.01
Organism:Cryptosporidium parvum
Description:ChEMBL_79057
Residue:444
BDBM50135767
NameBDBM50135767
TypeSmall organic molecule
Emp. Form.C33H47N5O7
Mol. Mass.625.7556
SMILESCCC(C)[C@@H]1NC(=O)[C@H](Cc2cn(OC)c3ccccc23)NC(=O)[C@H](CCCCCC(=O)OC)NC(=O)[C@H]2CCCCN2C1=O