Reaction Details
TargetHistone deacetylase
LigandBDBM50238632
Substrate/Competitorn/a
Meas. Tech.ChEMBL_87394 (CHEMBL691509)
IC50 1±n/a nM
Citation Miller, TAWitter, DJBelvedere, S Histone deacetylase inhibitors. J Med Chem46:5097-116 (2003) 
 
Histone deacetylase
Name:Histone deacetylase
Synonyms:n/a
Type:PROTEIN
Mol. Mass.:50433.01
Organism:Cryptosporidium parvum
Description:ChEMBL_79057
Residue:444
BDBM50238632
NameBDBM50238632
TypeSmall organic molecule
Emp. Form.C34H49N5O6
Mol. Mass.623.7828
SMILESCC[C@H](C)[C@@H]1NC(=O)[C@H](Cc2cn(OC)c3ccccc23)NC(=O)[C@H](CCCCCC(=O)CC)NC(=O)[C@H]2CCCCN2C1=O