Reaction Details
TargetHistone deacetylase 4
LigandBDBM50123958
Substrate/Competitorn/a
Meas. Tech.ChEMBL_207282 (CHEMBL811365)
EC50 1000±n/a nM
Citation Miller, TAWitter, DJBelvedere, S Histone deacetylase inhibitors. J Med Chem46:5097-116 (2003) 
 
Histone deacetylase 4
Name:Histone deacetylase 4
Type:Enzyme
Mol. Mass.:119049.39
Organism:Homo sapiens (Human)
Description:P56524
Residue:1084
BDBM50123958
NameBDBM50123958
Synonyms:3-[4-(3,4-Dimethoxy-phenylsulfamoyl)-phenyl]-N-hydroxy-acrylamide US8796330, 98
TypeSmall organic molecule
Emp. Form.C17H18N2O6S
Mol. Mass.378.4
SMILESCOc1ccc(NS(=O)(=O)c2ccc(\C=C\C(=O)NO)cc2)cc1OC