Reaction Details
TargetDelta-type opioid receptor
LigandBDBM50135809
Substrate/Competitorn/a
Meas. Tech.ChEMBL_145615 (CHEMBL754334)
Ki 16±n/a nM
Citation Neumeyer, JLZhang, AXiong, WGu, XHHilbert, JEKnapp, BINegus, SSMello, NKBidlack, JM Design and synthesis of novel dimeric morphinan ligands for kappa and micro opioid receptors. J Med Chem46:5162-70 (2003) 
 
Delta-type opioid receptor
Name:Delta-type opioid receptor
Type:G Protein-Coupled Receptor (GPCR)
Mol. Mass.:40382.98
Organism:Homo sapiens (Human)
Description:Competition binding assays were carried out using membrane preparations from transfected HN9.10 cells that constitutively expressed the delta opioid receptor.
Residue:372
BDBM50135809
NameBDBM50135809
Synonyms:CHEMBL150061 di[17-cyclobutylmethyl-(9R,10R)-17-azatetracyclo[7.5.3.01,10.02,7]heptadeca-2(7),3,5-trien-4-yl](1R,2S)-cyclopropane-1,2-dicarboxylate
TypeSmall organic molecule
Emp. Form.C47H60N2O4
Mol. Mass.716.9903
SMILESO=C(Oc1ccc2C[C@@H]3[C@@H]4CCCC[C@]4(CCN3CC3CCC3)c2c1)[C@H]1C[C@H]1C(=O)Oc1ccc2C[C@@H]3[C@@H]4CCCC[C@]4(CCN3CC3CCC3)c2c1