Reaction Details
TargetKappa-type opioid receptor
LigandBDBM50135793
Substrate/Competitorn/a
Meas. Tech.ChEMBL_147241 (CHEMBL755509)
EC50 4.9±n/a nM
Citation Neumeyer, JLZhang, AXiong, WGu, XHHilbert, JEKnapp, BINegus, SSMello, NKBidlack, JM Design and synthesis of novel dimeric morphinan ligands for kappa and micro opioid receptors. J Med Chem46:5162-70 (2003) 
 
Kappa-type opioid receptor
Name:Kappa-type opioid receptor
Type:G Protein-Coupled Receptor (GPCR)
Mol. Mass.:42648.76
Organism:Homo sapiens (Human)
Description:P41145
Residue:380
BDBM50135793
NameBDBM50135793
Synonyms:CHEMBL358104 | di[17-cyclopropylmethyl-(10R)-17-azatetracyclo[7.5.3.01,10.02,7]heptadeca-2(7),3,5-trien-4-yl] sebacate
TypeSmall organic molecule
Emp. Form.C50H68N2O4
Mol. Mass.761.0859
SMILESO=C(CCCCCCCCC(=O)Oc1ccc2C[C@@H]3[C@@H]4CCCC[C@]4(CCN3CC3CC3)c2c1)Oc1ccc2C[C@@H]3[C@@H]4CCCC[C@]4(CCN3CC3CC3)c2c1