Reaction Details
TargetMu-type opioid receptor
LigandBDBM50017233
Substrate/Competitorn/a
Meas. Tech.ChEMBL_148248 (CHEMBL753407)
Ki 0.21±n/a nM
Citation Neumeyer, JLZhang, AXiong, WGu, XHHilbert, JEKnapp, BINegus, SSMello, NKBidlack, JM Design and synthesis of novel dimeric morphinan ligands for kappa and micro opioid receptors. J Med Chem46:5162-70 (2003) 
 
Mu-type opioid receptor
Name:Mu-type opioid receptor
Type:G Protein-Coupled Receptor (GPCR)
Mol. Mass.:44789.51
Organism:Homo sapiens (Human)
Description:P35372
Residue:400
BDBM50017233
NameBDBM50017233
Synonyms:CHEMBL592 LEVORPHANOL
TypeSmall organic molecule
Emp. Form.C17H23NO
Mol. Mass.257.3706
SMILESCN1CC[C@]23CCCC[C@H]2[C@H]1Cc1ccc(O)cc31