Reaction Details
TargetKappa-type opioid receptor
LigandBDBM50135798
Substrate/Competitorn/a
Meas. Tech.ChEMBL_145395 (CHEMBL752737)
Ki 0.08±n/a nM
Citation Neumeyer, JLZhang, AXiong, WGu, XHHilbert, JEKnapp, BINegus, SSMello, NKBidlack, JM Design and synthesis of novel dimeric morphinan ligands for kappa and micro opioid receptors. J Med Chem46:5162-70 (2003) 
 
Kappa-type opioid receptor
Name:Kappa-type opioid receptor
Type:G Protein-Coupled Receptor (GPCR)
Mol. Mass.:42648.76
Organism:Homo sapiens (Human)
Description:P41145
Residue:380
BDBM50135798
NameBDBM50135798
Synonyms:CHEMBL433697 | di[17-cyclobutylmethyl-(10R)-17-azatetracyclo[7.5.3.01,10.02,7]heptadeca-2(7),3,5-trien-4-yl] succinate
TypeSmall organic molecule
Emp. Form.C46H60N2O4
Mol. Mass.704.9796
SMILESO=C(CCC(=O)Oc1ccc2C[C@@H]3[C@@H]4CCCC[C@]4(CCN3CC3CCC3)c2c1)Oc1ccc2C[C@@H]3[C@@H]4CCCC[C@]4(CCN3CC3CCC3)c2c1