Reaction Details
TargetMu-type opioid receptor
LigandBDBM50135801
Substrate/Competitorn/a
Meas. Tech.ChEMBL_148071 (CHEMBL754564)
IC50 1.8±n/a nM
Citation Neumeyer, JLZhang, AXiong, WGu, XHHilbert, JEKnapp, BINegus, SSMello, NKBidlack, JM Design and synthesis of novel dimeric morphinan ligands for kappa and micro opioid receptors. J Med Chem46:5162-70 (2003) 
 
Mu-type opioid receptor
Name:Mu-type opioid receptor
Type:G Protein-Coupled Receptor (GPCR)
Mol. Mass.:44789.51
Organism:Homo sapiens (Human)
Description:P35372
Residue:400
BDBM50135801
NameBDBM50135801
Synonyms:CHEMBL413512 | di[17-cyclopropylmethyl-(10R)-17-azatetracyclo[7.5.3.01,10.02,7]heptadeca-2(7),3,5-trien-4-yl] succinate
TypeSmall organic molecule
Emp. Form.C44H56N2O4
Mol. Mass.676.9264
SMILESO=C(CCC(=O)Oc1ccc2C[C@@H]3[C@@H]4CCCC[C@]4(CCN3CC3CC3)c2c1)Oc1ccc2C[C@@H]3[C@@H]4CCCC[C@]4(CCN3CC3CC3)c2c1