Reaction Details
TargetPurine nucleoside phosphorylase
LigandBDBM50195587
Substrate/Competitorn/a
Meas. Tech.ChEMBL_162007 (CHEMBL764178)
Ki 0.056±n/a nM
Citation Evans, GBFurneaux, RHLewandowicz, ASchramm, VLTyler, PC Synthesis of second-generation transition state analogues of human purine nucleoside phosphorylase. J Med Chem46:5271-6 (2003) 
 
Purine nucleoside phosphorylase
Name:Purine nucleoside phosphorylase
Type:Enzyme
Mol. Mass.:32119.53
Organism:Homo sapiens (Human)
Description:n/a
Residue:289
BDBM50195587
NameBDBM50195587
Synonyms:1,4-DIDEOXY-4-AZA-1-(S)-(9-DEAZAHYPOXANTHIN-9-YL)-D-RIBITOL CHEMBL1213652 Immucillin-H
TypeSmall organic molecule
Emp. Form.C11H14N4O4
Mol. Mass.266.2533
SMILESOC[C@H]1N[C@H]([C@H](O)[C@@H]1O)c1c[nH]c2c1nc[nH]c2=O