Reaction Details
TargetPurine nucleoside phosphorylase
LigandBDBM50293086
Substrate/Competitorn/a
Meas. Tech.ChEMBL_162006 (CHEMBL764177)
Ki 0.540000±n/a nM
Citation Evans, GBFurneaux, RHLewandowicz, ASchramm, VLTyler, PC Synthesis of second-generation transition state analogues of human purine nucleoside phosphorylase. J Med Chem46:5271-6 (2003) 
 
Purine nucleoside phosphorylase
Name:Purine nucleoside phosphorylase
Type:Enzyme
Mol. Mass.:32119.53
Organism:Homo sapiens (Human)
Description:n/a
Residue:289
BDBM50293086
NameBDBM50293086
Synonyms:(1S)-1,4-dideoxy-1,4-imino-1-(9-deazaguanin-9-yl)-D-ribitol 2-amino-7-[(2S,3S,4R,5R)-3,4-dihydroxy-5-(hydroxymethyl)pyrrolidin-2-yl]-1,5-dihydro-4H-pyrrolo[3,2-d]pyrimidin-4-one immucillin G
TypeSmall organic molecule
Emp. Form.C11H15N5O4
Mol. Mass.281.2679
SMILESNc1nc2c(c[nH]c2c(=O)[nH]1)[C@@H]1N[C@H](CO)[C@@H](O)[C@H]1O