Reaction Details
TargetCoagulation factor X
LigandBDBM18965
Substrate/Competitorn/a
Meas. Tech.ChEMBL_48828 (CHEMBL661801)
Ki 2.7±n/a nM
Citation Pruitt, JRPinto, DJGalemmo, RAAlexander, RSRossi, KAWells, BLDrummond, SBostrom, LLBurdick, DBruckner, RChen, HSmallwood, AWong, PCWright, MRBai, SLuettgen, JMKnabb, RMLam, PYWexler, RR Discovery of 1-(2-aminomethylphenyl)-3-trifluoromethyl-N- [3-fluoro-2'-(aminosulfonyl)[1,1'-biphenyl)]-4-yl]-1H-pyrazole-5-carboxyamide (DPC602), a potent, selective, and orally bioavailable factor Xa inhibitor(1). J Med Chem46:5298-315 (2003) 
 
Coagulation factor X
Name:Coagulation factor X
Type:Enzyme
Mol. Mass.:54726.60
Organism:Homo sapiens (Human)
Description:n/a
Residue:488
BDBM18965
NameBDBM18965
Synonyms:1-[3-(aminomethyl)phenyl]-3-methyl-N-[4-(2-sulfamoylphenyl)phenyl]-1H-pyrazole-5-carboxamide pyrazole-based inhibitor, 15a
TypeSmall organic molecule
Emp. Form.C24H23N5O3S
Mol. Mass.461.536
SMILESCc1cc(C(=O)Nc2ccc(cc2)-c2ccccc2S(N)(=O)=O)n(n1)-c1cccc(CN)c1