Reaction Details
TargetChymotrypsinogen A
LigandBDBM50135945
Substrate/Competitorn/a
Meas. Tech.ChEMBL_49755 (CHEMBL662087)
Ki 6800±n/a nM
Citation Pruitt, JRPinto, DJGalemmo, RAAlexander, RSRossi, KAWells, BLDrummond, SBostrom, LLBurdick, DBruckner, RChen, HSmallwood, AWong, PCWright, MRBai, SLuettgen, JMKnabb, RMLam, PYWexler, RR Discovery of 1-(2-aminomethylphenyl)-3-trifluoromethyl-N- [3-fluoro-2'-(aminosulfonyl)[1,1'-biphenyl)]-4-yl]-1H-pyrazole-5-carboxyamide (DPC602), a potent, selective, and orally bioavailable factor Xa inhibitor(1). J Med Chem46:5298-315 (2003) 
 
Chymotrypsinogen A
Name:Chymotrypsinogen A
Type:Serine protease
Mol. Mass.:25670.88
Organism:Bos taurus (bovine)
Description:n/a
Residue:245
BDBM50135945
NameBDBM50135945
Synonyms:1-[2-(aminomethyl)phenyl]-N-(3-fluoro-2'-sulfamoylbiphenyl-4-yl)-3-(trifluoromethyl)-1H-pyrazole-5-carboxamide CHEMBL151939
TypeSmall organic molecule
Emp. Form.C24H19F4N5O3S
Mol. Mass.533.498
SMILESNCc1ccccc1-n1nc(cc1C(=O)Nc1ccc(cc1F)-c1ccccc1S(N)(=O)=O)C(F)(F)F