Reaction Details
TargetMu-type opioid receptor
LigandBDBM50027094
Substrate/Competitorn/a
Meas. Tech.ChEMBL_148230 (CHEMBL753390)
Ki 37±n/a nM
Citation Black, SLChauvignac, CGrundt, PMiller, CNWood, STraynor, JRLewis, JWHusbands, SM Guanidino N-substituted and N,N-disubstituted derivatives of the kappa-opioid antagonist GNTI. J Med Chem46:5505-11 (2003) 
 
Mu-type opioid receptor
Name:Mu-type opioid receptor
Type:G Protein-Coupled Receptor (GPCR)
Mol. Mass.:44789.51
Organism:Homo sapiens (Human)
Description:P35372
Residue:400
BDBM50027094
NameBDBM50027094
Synonyms:CHEMBL2112374
TypeSmall organic molecule
Emp. Form.C28H31N5O3
Mol. Mass.485.5774
SMILES[H][C@@]12Oc3c4c(C[C@@]5([H])N(CC6CC6)CC[C@@]14[C@@]5(O)Cc1c2[nH]c2ccc(CNC(N)=N)cc12)ccc3O