Reaction Details
TargetKappa-type opioid receptor
LigandBDBM50027093
Substrate/Competitorn/a
Meas. Tech.ChEMBL_145259 (CHEMBL751037)
Ki 0.490000±n/a nM
Citation Black, SLChauvignac, CGrundt, PMiller, CNWood, STraynor, JRLewis, JWHusbands, SM Guanidino N-substituted and N,N-disubstituted derivatives of the kappa-opioid antagonist GNTI. J Med Chem46:5505-11 (2003) 
 
Kappa-type opioid receptor
Name:Kappa-type opioid receptor
Type:G Protein-Coupled Receptor (GPCR)
Mol. Mass.:42648.76
Organism:Homo sapiens (Human)
Description:P41145
Residue:380
BDBM50027093
NameBDBM50027093
Synonyms:CHEMBL2112373
TypeSmall organic molecule
Emp. Form.C29H33N5O3
Mol. Mass.499.604
SMILES[H][C@@]12Oc3c4c(C[C@@]5([H])N(CC6CC6)CC[C@@]14[C@@]5(O)Cc1c2[nH]c2ccc(CCNC(N)=N)cc12)ccc3O