Reaction Details
TargetDelta-type opioid receptor
LigandBDBM50136124
Substrate/Competitorn/a
Meas. Tech.ChEMBL_145490 (CHEMBL752133)
Ki 19±n/a nM
Citation Black, SLChauvignac, CGrundt, PMiller, CNWood, STraynor, JRLewis, JWHusbands, SM Guanidino N-substituted and N,N-disubstituted derivatives of the kappa-opioid antagonist GNTI. J Med Chem46:5505-11 (2003) 
 
Delta-type opioid receptor
Name:Delta-type opioid receptor
Type:G Protein-Coupled Receptor (GPCR)
Mol. Mass.:40382.98
Organism:Homo sapiens (Human)
Description:Competition binding assays were carried out using membrane preparations from transfected HN9.10 cells that constitutively expressed the delta opioid receptor.
Residue:372
BDBM50136124
NameBDBM50136124
Synonyms:7-{2-[4-chlorobenzylamino(imino)methylamino]ethyl}-22-cyclopropylmethyl-14-oxa-11,22-diazaheptacyclo[13.9.1.01,13.02,21.04,12.05,10.019,25]pentacosa-4(12),5(10),6,8,15,17,19(25)-heptaene-2,16-diol
TypeSmall organic molecule
Emp. Form.C36H38ClN5O3
Mol. Mass.624.172
SMILESOc1ccc2CC3N(CC4CC4)CC[C@@]45[C@@H](Oc1c24)c1[nH]c2ccc(CCNC(=N)NCc4ccc(Cl)cc4)cc2c1C[C@@]35O