Reaction Details
TargetDelta-type opioid receptor
LigandBDBM50027093
Substrate/Competitorn/a
Meas. Tech.ChEMBL_145490 (CHEMBL752133)
Ki 4.9±n/a nM
Citation Black, SLChauvignac, CGrundt, PMiller, CNWood, STraynor, JRLewis, JWHusbands, SM Guanidino N-substituted and N,N-disubstituted derivatives of the kappa-opioid antagonist GNTI. J Med Chem46:5505-11 (2003) 
 
Delta-type opioid receptor
Name:Delta-type opioid receptor
Type:G Protein-Coupled Receptor (GPCR)
Mol. Mass.:40382.98
Organism:Homo sapiens (Human)
Description:Competition binding assays were carried out using membrane preparations from transfected HN9.10 cells that constitutively expressed the delta opioid receptor.
Residue:372
BDBM50027093
NameBDBM50027093
Synonyms:CHEMBL2112373
TypeSmall organic molecule
Emp. Form.C29H33N5O3
Mol. Mass.499.604
SMILES[H][C@@]12Oc3c4c(C[C@@]5([H])N(CC6CC6)CC[C@@]14[C@@]5(O)Cc1c2[nH]c2ccc(CCNC(N)=N)cc12)ccc3O