Reaction Details
TargetMu-type opioid receptor
LigandBDBM50136116
Substrate/Competitorn/a
Meas. Tech.ChEMBL_148230 (CHEMBL753390)
Ki 3.5±n/a nM
Citation Black, SLChauvignac, CGrundt, PMiller, CNWood, STraynor, JRLewis, JWHusbands, SM Guanidino N-substituted and N,N-disubstituted derivatives of the kappa-opioid antagonist GNTI. J Med Chem46:5505-11 (2003) 
 
Mu-type opioid receptor
Name:Mu-type opioid receptor
Type:G Protein-Coupled Receptor (GPCR)
Mol. Mass.:44789.51
Organism:Homo sapiens (Human)
Description:P35372
Residue:400
BDBM50136116
NameBDBM50136116
Synonyms:7-[2-benzylamino(imino)methylaminoethyl]-22-cyclopropylmethyl-14-oxa-11,22-diazaheptacyclo[13.9.1.01,13.02,21.04,12.05,10.019,25]pentacosa-4(12),5(10),6,8,15,17,19(25)-heptaene-2,16-diol
TypeSmall organic molecule
Emp. Form.C36H39N5O3
Mol. Mass.589.7266
SMILESOc1ccc2CC3N(CC4CC4)CC[C@@]45[C@@H](Oc1c24)c1[nH]c2ccc(CCNC(=N)NCc4ccccc4)cc2c1C[C@@]35O