Reaction Details
TargetMitogen-activated protein kinase 14
LigandBDBM50136886
Substrate/Competitorn/a
Meas. Tech.ChEMBL_124178 (CHEMBL732094)
IC50 10±n/a nM
Citation Ottosen, ERSørensen, MDBjörkling, FSkak-Nielsen, TFjording, MSAaes, HBinderup, L Synthesis and structure-activity relationship of aminobenzophenones. A novel class of p38 MAP kinase inhibitors with high antiinflammatory activity. J Med Chem46:5651-62 (2003) 
 
Mitogen-activated protein kinase 14
Name:Mitogen-activated protein kinase 14
Type:Serine/threonine-protein kinase
Mol. Mass.:41286.76
Organism:Homo sapiens (Human)
Description:Q16539
Residue:360
BDBM50136886
NameBDBM50136886
Synonyms:CHEMBL152767 | [4-(2-Amino-phenylamino)-2-chloro-phenyl]-o-tolyl-methanone
TypeSmall organic molecule
Emp. Form.C20H17ClN2O
Mol. Mass.336.815
SMILESCc1ccccc1C(=O)c1ccc(Nc2ccccc2N)cc1Cl