Reaction Details
TargetMitogen-activated protein kinase 14
LigandBDBM50136885
Substrate/Competitorn/a
Meas. Tech.ChEMBL_124178 (CHEMBL732094)
IC50 39±n/a nM
Citation Ottosen, ERSørensen, MDBjörkling, FSkak-Nielsen, TFjording, MSAaes, HBinderup, L Synthesis and structure-activity relationship of aminobenzophenones. A novel class of p38 MAP kinase inhibitors with high antiinflammatory activity. J Med Chem46:5651-62 (2003) 
 
Mitogen-activated protein kinase 14
Name:Mitogen-activated protein kinase 14
Type:Serine/threonine-protein kinase
Mol. Mass.:41286.76
Organism:Homo sapiens (Human)
Description:Q16539
Residue:360
BDBM50136885
NameBDBM50136885
Synonyms:CHEMBL347496 | [4-(2-Amino-4-bromo-phenylamino)-2-chloro-phenyl]-o-tolyl-methanone
TypeSmall organic molecule
Emp. Form.C20H16BrClN2O
Mol. Mass.415.711
SMILESCc1ccccc1C(=O)c1ccc(Nc2ccc(Br)cc2N)cc1Cl