Reaction Details
TargetMitogen-activated protein kinase 14
LigandBDBM50136887
Substrate/Competitorn/a
Meas. Tech.ChEMBL_124178 (CHEMBL732094)
IC50 5±n/a nM
Citation Ottosen, ERSørensen, MDBjörkling, FSkak-Nielsen, TFjording, MSAaes, HBinderup, L Synthesis and structure-activity relationship of aminobenzophenones. A novel class of p38 MAP kinase inhibitors with high antiinflammatory activity. J Med Chem46:5651-62 (2003) 
 
Mitogen-activated protein kinase 14
Name:Mitogen-activated protein kinase 14
Type:Serine/threonine-protein kinase
Mol. Mass.:41286.76
Organism:Homo sapiens (Human)
Description:Q16539
Residue:360
BDBM50136887
NameBDBM50136887
Synonyms:CHEMBL356455 | [4-(2-Amino-phenylamino)-2-chloro-phenyl]-(2-methoxy-phenyl)-methanone
TypeSmall organic molecule
Emp. Form.C20H17ClN2O2
Mol. Mass.352.814
SMILESCOc1ccccc1C(=O)c1ccc(Nc2ccccc2N)cc1Cl