Reaction Details
TargetSolute carrier family 15 member 1
LigandBDBM50136965
Substrate/Competitorn/a
Meas. Tech.ChEMBL_89213 (CHEMBL699705)
Ki 10000±n/a nM
Citation Gebauer, SKnütter, IHartrodt, BBrandsch, MNeubert, KThondorf, I Three-dimensional quantitative structure-activity relationship analyses of peptide substrates of the mammalian H+/peptide cotransporter PEPT1. J Med Chem46:5725-34 (2003) 
 
Solute carrier family 15 member 1
Name:Solute carrier family 15 member 1
Type:PROTEIN
Mol. Mass.:78818.07
Organism:Homo sapiens (Human)
Description:ChEMBL_1488839
Residue:708
BDBM50136965
NameBDBM50136965
Synonyms:2-({2-ammonio-3-[4-(benzyloxy)phenyl]propanoyl}amino)propanoate | CHEMBL156844
TypeSmall organic molecule
Emp. Form.C19H22N2O4
Mol. Mass.342.389
SMILESCC(NC(=O)C([NH3+])Cc1ccc(OCc2ccccc2)cc1)C([O-])=O