Reaction Details
TargetSolute carrier family 15 member 1
LigandBDBM50136962
Substrate/Competitorn/a
Meas. Tech.ChEMBL_89213 (CHEMBL699705)
Ki 160000±n/a nM
Citation Gebauer, SKnütter, IHartrodt, BBrandsch, MNeubert, KThondorf, I Three-dimensional quantitative structure-activity relationship analyses of peptide substrates of the mammalian H+/peptide cotransporter PEPT1. J Med Chem46:5725-34 (2003) 
 
Solute carrier family 15 member 1
Name:Solute carrier family 15 member 1
Type:PROTEIN
Mol. Mass.:78818.07
Organism:Homo sapiens (Human)
Description:ChEMBL_1488839
Residue:708
BDBM50136962
NameBDBM50136962
Synonyms:2-{[2-ammonio-3-(1H-indol-2-yl)propanoyl]amino}propanoate | CHEMBL359119
TypeSmall organic molecule
Emp. Form.C14H17N3O3
Mol. Mass.275.3031
SMILESCC(NC(=O)C([NH3+])Cc1cc2ccccc2[nH]1)C([O-])=O