Reaction Details
TargetSolute carrier family 15 member 1
LigandBDBM50136966
Substrate/Competitorn/a
Meas. Tech.ChEMBL_89213 (CHEMBL699705)
Ki 160000±n/a nM
Citation Gebauer, SKnütter, IHartrodt, BBrandsch, MNeubert, KThondorf, I Three-dimensional quantitative structure-activity relationship analyses of peptide substrates of the mammalian H+/peptide cotransporter PEPT1. J Med Chem46:5725-34 (2003) 
 
Solute carrier family 15 member 1
Name:Solute carrier family 15 member 1
Type:PROTEIN
Mol. Mass.:78818.07
Organism:Homo sapiens (Human)
Description:ChEMBL_1488839
Residue:708
BDBM50136966
NameBDBM50136966
Synonyms:1-(2-ammoniohexanoyl)pyrrolidine-2-carboxylate | CHEMBL154677
TypeSmall organic molecule
Emp. Form.C11H20N2O3
Mol. Mass.228.2881
SMILESCCCCC([NH3+])C(=O)N1CCCC1C([O-])=O