Reaction Details
TargetSolute carrier family 15 member 1
LigandBDBM50136979
Substrate/Competitorn/a
Meas. Tech.ChEMBL_89213 (CHEMBL699705)
Ki 12900000±n/a nM
Citation Gebauer, SKnütter, IHartrodt, BBrandsch, MNeubert, KThondorf, I Three-dimensional quantitative structure-activity relationship analyses of peptide substrates of the mammalian H+/peptide cotransporter PEPT1. J Med Chem46:5725-34 (2003) 
 
Solute carrier family 15 member 1
Name:Solute carrier family 15 member 1
Type:PROTEIN
Mol. Mass.:78818.07
Organism:Homo sapiens (Human)
Description:ChEMBL_1488839
Residue:708
BDBM50136979
NameBDBM50136979
Synonyms:1-oxo-1-piperidin-1-ylpropan-2-aminium
TypeSmall organic molecule
Emp. Form.C8H17N2O
Mol. Mass.157.2328
SMILESCC([NH3+])C(=O)N1CCCCC1