Reaction Details
TargetSolute carrier family 15 member 1
LigandBDBM50136981
Substrate/Competitorn/a
Meas. Tech.ChEMBL_89213 (CHEMBL699705)
Ki 130000±n/a nM
Citation Gebauer, SKnütter, IHartrodt, BBrandsch, MNeubert, KThondorf, I Three-dimensional quantitative structure-activity relationship analyses of peptide substrates of the mammalian H+/peptide cotransporter PEPT1. J Med Chem46:5725-34 (2003) 
 
Solute carrier family 15 member 1
Name:Solute carrier family 15 member 1
Type:PROTEIN
Mol. Mass.:78818.07
Organism:Homo sapiens (Human)
Description:ChEMBL_1488839
Residue:708
BDBM50136981
NameBDBM50136981
Synonyms:1-[2-ammonio-3-(1H-indol-2-yl)propanoyl]pyrrolidine-2-carboxylate | CHEMBL348876
TypeSmall organic molecule
Emp. Form.C16H19N3O3
Mol. Mass.301.3404
SMILES[NH3+]C(Cc1cc2ccccc2[nH]1)C(=O)N1CCCC1C([O-])=O