Reaction Details
TargetSolute carrier family 15 member 1
LigandBDBM50136996
Substrate/Competitorn/a
Meas. Tech.ChEMBL_89213 (CHEMBL699705)
Ki 20000000±n/a nM
Citation Gebauer, SKnütter, IHartrodt, BBrandsch, MNeubert, KThondorf, I Three-dimensional quantitative structure-activity relationship analyses of peptide substrates of the mammalian H+/peptide cotransporter PEPT1. J Med Chem46:5725-34 (2003) 
 
Solute carrier family 15 member 1
Name:Solute carrier family 15 member 1
Type:PROTEIN
Mol. Mass.:78818.07
Organism:Homo sapiens (Human)
Description:ChEMBL_1488839
Residue:708
BDBM50136996
NameBDBM50136996
Synonyms:2-[(pyrrolidinium-2-ylcarbonyl)amino]pentanedioate
TypeSmall organic molecule
Emp. Form.C10H15N2O5
Mol. Mass.243.237
SMILES[O-]C(=O)CCC(NC(=O)C1CCC[NH2+]1)C([O-])=O