Reaction Details
TargetSolute carrier family 15 member 1
LigandBDBM50136989
Substrate/Competitorn/a
Meas. Tech.ChEMBL_89213 (CHEMBL699705)
Ki 140000±n/a nM
Citation Gebauer, SKnütter, IHartrodt, BBrandsch, MNeubert, KThondorf, I Three-dimensional quantitative structure-activity relationship analyses of peptide substrates of the mammalian H+/peptide cotransporter PEPT1. J Med Chem46:5725-34 (2003) 
 
Solute carrier family 15 member 1
Name:Solute carrier family 15 member 1
Type:PROTEIN
Mol. Mass.:78818.07
Organism:Homo sapiens (Human)
Description:ChEMBL_1488839
Residue:708
BDBM50136989
NameBDBM50136989
Synonyms:2-[(2-ammonio-3-hydroxypropanoyl)amino]propanoate | CHEMBL153727
TypeSmall organic molecule
Emp. Form.C6H12N2O4
Mol. Mass.176.1705
SMILESCC(NC(=O)C([NH3+])CO)C([O-])=O