Reaction Details
TargetSolute carrier family 15 member 1
LigandBDBM50136993
Substrate/Competitorn/a
Meas. Tech.ChEMBL_89213 (CHEMBL699705)
Ki 90000±n/a nM
Citation Gebauer, SKnütter, IHartrodt, BBrandsch, MNeubert, KThondorf, I Three-dimensional quantitative structure-activity relationship analyses of peptide substrates of the mammalian H+/peptide cotransporter PEPT1. J Med Chem46:5725-34 (2003) 
 
Solute carrier family 15 member 1
Name:Solute carrier family 15 member 1
Type:PROTEIN
Mol. Mass.:78818.07
Organism:Homo sapiens (Human)
Description:ChEMBL_1488839
Residue:708
BDBM50136993
NameBDBM50136993
Synonyms:2-[2-azaniumyl-3-(4-hydroxyphenyl)propanamido]-3-phenylpropanoate CHEMBL154013
TypeSmall organic molecule
Emp. Form.C18H20N2O4
Mol. Mass.328.3624
SMILES[NH3+]C(Cc1ccc(O)cc1)C(=O)NC(Cc1ccccc1)C([O-])=O