Reaction Details
TargetSolute carrier family 15 member 1
LigandBDBM50136995
Substrate/Competitorn/a
Meas. Tech.ChEMBL_89213 (CHEMBL699705)
Ki 130000±n/a nM
Citation Gebauer, SKnütter, IHartrodt, BBrandsch, MNeubert, KThondorf, I Three-dimensional quantitative structure-activity relationship analyses of peptide substrates of the mammalian H+/peptide cotransporter PEPT1. J Med Chem46:5725-34 (2003) 
 
Solute carrier family 15 member 1
Name:Solute carrier family 15 member 1
Type:PROTEIN
Mol. Mass.:78818.07
Organism:Homo sapiens (Human)
Description:ChEMBL_1488839
Residue:708
BDBM50136995
NameBDBM50136995
Synonyms:1-(2-ammonio-3-hydroxypropanoyl)pyrrolidine-2-carboxylate | CHEMBL153886
TypeSmall organic molecule
Emp. Form.C8H14N2O4
Mol. Mass.202.2078
SMILES[NH3+]C(CO)C(=O)N1CCCC1C([O-])=O