Reaction Details
TargetSolute carrier family 15 member 1
LigandBDBM50136997
Substrate/Competitorn/a
Meas. Tech.ChEMBL_89213 (CHEMBL699705)
Ki 470000±n/a nM
Citation Gebauer, SKnütter, IHartrodt, BBrandsch, MNeubert, KThondorf, I Three-dimensional quantitative structure-activity relationship analyses of peptide substrates of the mammalian H+/peptide cotransporter PEPT1. J Med Chem46:5725-34 (2003) 
 
Solute carrier family 15 member 1
Name:Solute carrier family 15 member 1
Type:PROTEIN
Mol. Mass.:78818.07
Organism:Homo sapiens (Human)
Description:ChEMBL_1488839
Residue:708
BDBM50136997
NameBDBM50136997
Synonyms:4-methyl-2-[(pyrrolidinium-2-ylcarbonyl)amino]pentanoate | CHEMBL152125
TypeSmall organic molecule
Emp. Form.C11H20N2O3
Mol. Mass.228.2881
SMILESCC(C)CC(NC(=O)C1CCC[NH2+]1)C([O-])=O