Reaction Details
TargetSolute carrier family 15 member 1
LigandBDBM50137012
Substrate/Competitorn/a
Meas. Tech.ChEMBL_89213 (CHEMBL699705)
Ki 730000±n/a nM
Citation Gebauer, SKnütter, IHartrodt, BBrandsch, MNeubert, KThondorf, I Three-dimensional quantitative structure-activity relationship analyses of peptide substrates of the mammalian H+/peptide cotransporter PEPT1. J Med Chem46:5725-34 (2003) 
 
Solute carrier family 15 member 1
Name:Solute carrier family 15 member 1
Type:PROTEIN
Mol. Mass.:78818.07
Organism:Homo sapiens (Human)
Description:ChEMBL_1488839
Residue:708
BDBM50137012
NameBDBM50137012
Synonyms:3-(4-hydroxyphenyl)-2-[(pyrrolidinium-2-ylcarbonyl)amino]propanoate | CHEMBL347126
TypeSmall organic molecule
Emp. Form.C14H18N2O4
Mol. Mass.278.3037
SMILESOc1ccc(CC(NC(=O)C2CCC[NH2+]2)C([O-])=O)cc1