Reaction Details
TargetSolute carrier family 15 member 1
LigandBDBM50137016
Substrate/Competitorn/a
Meas. Tech.ChEMBL_89213 (CHEMBL699705)
Ki 5600000±n/a nM
Citation Gebauer, SKnütter, IHartrodt, BBrandsch, MNeubert, KThondorf, I Three-dimensional quantitative structure-activity relationship analyses of peptide substrates of the mammalian H+/peptide cotransporter PEPT1. J Med Chem46:5725-34 (2003) 
 
Solute carrier family 15 member 1
Name:Solute carrier family 15 member 1
Type:PROTEIN
Mol. Mass.:78818.07
Organism:Homo sapiens (Human)
Description:ChEMBL_1488839
Residue:708
BDBM50137016
NameBDBM50137016
Synonyms:2-[(2-{[(benzyloxy)carbonyl]amino}propanoyl)amino]propanoate
TypeSmall organic molecule
Emp. Form.C14H17N2O5
Mol. Mass.293.2957
SMILESCC(NC(=O)C(C)NC(=O)OCc1ccccc1)C([O-])=O