Reaction Details
TargetSolute carrier family 15 member 1
LigandBDBM50137010
Substrate/Competitorn/a
Meas. Tech.ChEMBL_89213 (CHEMBL699705)
Ki 260000±n/a nM
Citation Gebauer, SKnütter, IHartrodt, BBrandsch, MNeubert, KThondorf, I Three-dimensional quantitative structure-activity relationship analyses of peptide substrates of the mammalian H+/peptide cotransporter PEPT1. J Med Chem46:5725-34 (2003) 
 
Solute carrier family 15 member 1
Name:Solute carrier family 15 member 1
Type:PROTEIN
Mol. Mass.:78818.07
Organism:Homo sapiens (Human)
Description:ChEMBL_1488839
Residue:708
BDBM50137010
NameBDBM50137010
Synonyms:2-[(2-ammoniopropanoyl)amino]succinate
TypeSmall organic molecule
Emp. Form.C7H11N2O5
Mol. Mass.203.1732
SMILESCC([NH3+])C(=O)NC(CC([O-])=O)C([O-])=O