Reaction Details
TargetSolute carrier family 15 member 1
LigandBDBM50137021
Substrate/Competitorn/a
Meas. Tech.ChEMBL_89213 (CHEMBL699705)
Ki 100000±n/a nM
Citation Gebauer, SKnütter, IHartrodt, BBrandsch, MNeubert, KThondorf, I Three-dimensional quantitative structure-activity relationship analyses of peptide substrates of the mammalian H+/peptide cotransporter PEPT1. J Med Chem46:5725-34 (2003) 
 
Solute carrier family 15 member 1
Name:Solute carrier family 15 member 1
Type:PROTEIN
Mol. Mass.:78818.07
Organism:Homo sapiens (Human)
Description:ChEMBL_1488839
Residue:708
BDBM50137021
NameBDBM50137021
Synonyms:2-[(2-ammonio-3-methylbutanoyl)amino]-3-(4-hydroxyphenyl)propanoate | CHEMBL152586
TypeSmall organic molecule
Emp. Form.C14H20N2O4
Mol. Mass.280.3196
SMILESCC(C)C([NH3+])C(=O)NC(Cc1ccc(O)cc1)C([O-])=O