Reaction Details
TargetSolute carrier family 15 member 1
LigandBDBM50137027
Substrate/Competitorn/a
Meas. Tech.ChEMBL_89213 (CHEMBL699705)
Ki 5400000±n/a nM
Citation Gebauer, SKnütter, IHartrodt, BBrandsch, MNeubert, KThondorf, I Three-dimensional quantitative structure-activity relationship analyses of peptide substrates of the mammalian H+/peptide cotransporter PEPT1. J Med Chem46:5725-34 (2003) 
 
Solute carrier family 15 member 1
Name:Solute carrier family 15 member 1
Type:PROTEIN
Mol. Mass.:78818.07
Organism:Homo sapiens (Human)
Description:ChEMBL_1488839
Residue:708
BDBM50137027
NameBDBM50137027
Synonyms:4-[(2-amino-1-methyl-2-oxoethyl)amino]-3-ammonio-4-oxobutanoate | CHEMBL154543
TypeSmall organic molecule
Emp. Form.C7H13N3O4
Mol. Mass.203.1958
SMILESCC(NC(=O)C([NH3+])CC([O-])=O)C(N)=O