Reaction Details
TargetSolute carrier family 15 member 1
LigandBDBM50137039
Substrate/Competitorn/a
Meas. Tech.ChEMBL_89213 (CHEMBL699705)
Ki 1100000±n/a nM
Citation Gebauer, SKnütter, IHartrodt, BBrandsch, MNeubert, KThondorf, I Three-dimensional quantitative structure-activity relationship analyses of peptide substrates of the mammalian H+/peptide cotransporter PEPT1. J Med Chem46:5725-34 (2003) 
 
Solute carrier family 15 member 1
Name:Solute carrier family 15 member 1
Type:PROTEIN
Mol. Mass.:78818.07
Organism:Homo sapiens (Human)
Description:ChEMBL_1488839
Residue:708
BDBM50137039
NameBDBM50137039
Synonyms:1-{[4-(methoxycarbonyl)phenyl]amino}-1-oxopropan-2-aminium
TypeSmall organic molecule
Emp. Form.C11H15N2O3
Mol. Mass.223.2479
SMILESCOC(=O)c1ccc(NC(=O)C(C)[NH3+])cc1