Reaction Details
TargetSolute carrier family 15 member 1
LigandBDBM50169137
Substrate/Competitorn/a
Meas. Tech.ChEMBL_89213 (CHEMBL699705)
Ki 4900000±n/a nM
Citation Gebauer, SKnütter, IHartrodt, BBrandsch, MNeubert, KThondorf, I Three-dimensional quantitative structure-activity relationship analyses of peptide substrates of the mammalian H+/peptide cotransporter PEPT1. J Med Chem46:5725-34 (2003) 
 
Solute carrier family 15 member 1
Name:Solute carrier family 15 member 1
Type:PROTEIN
Mol. Mass.:78818.07
Organism:Homo sapiens (Human)
Description:ChEMBL_1488839
Residue:708
BDBM50169137
NameBDBM50169137
Synonyms:(R)-1-((R)-2-Amino-propionyl)-pyrrolidine-2-carboxylic acid | CHEMBL365196
TypeSmall organic molecule
Emp. Form.C8H14N2O3
Mol. Mass.186.2084
SMILESC[C@@H](N)C(=O)N1CCC[C@@H]1C(O)=O