Reaction Details
TargetMu-type opioid receptor
LigandBDBM50123658
Substrate/Competitorn/a
Meas. Tech.ChEMBL_148853 (CHEMBL756649)
Ki 0.46±n/a nM
Citation Bishop, MJGarrido, DMBoswell, GECollins, MAHarris, PAMcNutt, RWO'Neill, SJWei, KChang, KJ 3-(alphaR)-alpha-((2S,5R)-4-allyl-2,5-dimethyl-1-piperazinyl)-3-hydroxybenzyl)-N-alkyl-N-arylbenzamides: potent, non-peptidic agonists of both the micro and delta opioid receptors. J Med Chem46:623-33 (2003) 
 
Mu-type opioid receptor
Name:Mu-type opioid receptor
Type:G Protein-Coupled Receptor (GPCR)
Mol. Mass.:44503.11
Organism:Rattus norvegicus (rat)
Description:Competition binding assays were carried out using membrane preparations from transfected HN9.10 cells that constitutively expressed the mu opioid receptor.
Residue:398
BDBM50123658
NameBDBM50123658
Synonyms:3-[(R)-((2S,5R)-4-Allyl-2,5-dimethyl-piperazin-1-yl)-(3-hydroxy-phenyl)-methyl]-N-(3-fluoro-phenyl)-N-methyl-benzamide | CHEMBL155892
TypeSmall organic molecule
Emp. Form.C30H34FN3O2
Mol. Mass.487.6083
SMILESC[C@@H]1CN([C@@H](c2cccc(O)c2)c2cccc(c2)C(=O)N(C)c2cccc(F)c2)[C@@H](C)CN1CC=C