Reaction Details
TargetMu-type opioid receptor
LigandBDBM50123756
Substrate/Competitorn/a
Meas. Tech.ChEMBL_145578 (CHEMBL749654)
EC50 49±n/a nM
Citation Harrison, BAPasternak, GWVerdine, GL 2,6-Dimethyltyrosine analogues of a stereodiversified ligand library: highly potent, selective, non-peptidic mu opioid receptor agonists. J Med Chem46:677-80 (2003) 
 
Mu-type opioid receptor
Name:Mu-type opioid receptor
Type:G Protein-Coupled Receptor (GPCR)
Mol. Mass.:44789.51
Organism:Homo sapiens (Human)
Description:P35372
Residue:400
BDBM50123756
NameBDBM50123756
Synonyms:(E)-(1S,2R,6S,7R)-2,6-Dihydroxy-1-(4-hydroxy-2,6-dimethyl-benzyl)-7-phenethylcarbamoyl-8-phenyl-oct-4-enyl-ammonium
TypeSmall organic molecule
Emp. Form.C32H41N2O4
Mol. Mass.517.6784
SMILESCc1cc(O)cc(C)c1C[C@H]([NH3+])[C@H](O)C\C=C\[C@H](O)[C@@H](Cc1ccccc1)C(=O)NCCc1ccccc1