Reaction Details
TargetDelta-type opioid receptor
LigandBDBM50123760
Substrate/Competitorn/a
Meas. Tech.ChEMBL_145491 (CHEMBL752134)
Ki 21±n/a nM
Citation Harrison, BAPasternak, GWVerdine, GL 2,6-Dimethyltyrosine analogues of a stereodiversified ligand library: highly potent, selective, non-peptidic mu opioid receptor agonists. J Med Chem46:677-80 (2003) 
 
Delta-type opioid receptor
Name:Delta-type opioid receptor
Type:G Protein-Coupled Receptor (GPCR)
Mol. Mass.:40382.98
Organism:Homo sapiens (Human)
Description:Competition binding assays were carried out using membrane preparations from transfected HN9.10 cells that constitutively expressed the delta opioid receptor.
Residue:372
BDBM50123760
NameBDBM50123760
Synonyms:(E)-(1S,2S,6S,7R)-7-((S)-1-Carbamoyl-2-phenyl-ethoxycarbonyl)-2,6-dihydroxy-1-(4-hydroxy-2,6-dimethyl-benzyl)-8-phenyl-oct-4-enyl-ammonium
TypeSmall organic molecule
Emp. Form.C33H41N2O6
Mol. Mass.561.6879
SMILESCc1cc(O)cc(C)c1C[C@H]([NH3+])[C@@H](O)C\C=C\[C@H](O)[C@@H](Cc1ccccc1)C(=O)O[C@@H](Cc1ccccc1)C(N)=O