Reaction Details
TargetDelta-type opioid receptor
LigandBDBM50123754
Substrate/Competitorn/a
Meas. Tech.ChEMBL_145491 (CHEMBL752134)
Ki 56±n/a nM
Citation Harrison, BAPasternak, GWVerdine, GL 2,6-Dimethyltyrosine analogues of a stereodiversified ligand library: highly potent, selective, non-peptidic mu opioid receptor agonists. J Med Chem46:677-80 (2003) 
 
Delta-type opioid receptor
Name:Delta-type opioid receptor
Type:G Protein-Coupled Receptor (GPCR)
Mol. Mass.:40382.98
Organism:Homo sapiens (Human)
Description:Competition binding assays were carried out using membrane preparations from transfected HN9.10 cells that constitutively expressed the delta opioid receptor.
Residue:372
BDBM50123754
NameBDBM50123754
Synonyms:(E)-(1S,2S,6S,7R)-2,6-Dihydroxy-1-(4-hydroxy-2,6-dimethyl-benzyl)-7-phenethyloxycarbonyl-8-phenyl-oct-4-enyl-ammonium
TypeSmall organic molecule
Emp. Form.C32H40NO5
Mol. Mass.518.6632
SMILESCc1cc(O)cc(C)c1C[C@H]([NH3+])[C@@H](O)C\C=C\[C@H](O)[C@@H](Cc1ccccc1)C(=O)OCCc1ccccc1