Reaction Details
TargetDelta-type opioid receptor
LigandBDBM50123759
Substrate/Competitorn/a
Meas. Tech.ChEMBL_145491 (CHEMBL752134)
Ki 36±n/a nM
Citation Harrison, BAPasternak, GWVerdine, GL 2,6-Dimethyltyrosine analogues of a stereodiversified ligand library: highly potent, selective, non-peptidic mu opioid receptor agonists. J Med Chem46:677-80 (2003) 
 
Delta-type opioid receptor
Name:Delta-type opioid receptor
Type:G Protein-Coupled Receptor (GPCR)
Mol. Mass.:40382.98
Organism:Homo sapiens (Human)
Description:Competition binding assays were carried out using membrane preparations from transfected HN9.10 cells that constitutively expressed the delta opioid receptor.
Residue:372
BDBM50123759
NameBDBM50123759
Synonyms:(E)-(1S,2S,6R,7R)-7-((S)-1-Carbamoyl-2-phenyl-ethylcarbamoyl)-2,6-dihydroxy-1-(4-hydroxy-2,6-dimethyl-benzyl)-8-phenyl-oct-4-enyl-ammonium
TypeSmall organic molecule
Emp. Form.C33H42N3O5
Mol. Mass.560.7031
SMILESCc1cc(O)cc(C)c1C[C@H]([NH3+])[C@@H](O)C\C=C\[C@@H](O)[C@@H](Cc1ccccc1)C(=O)N[C@@H](Cc1ccccc1)C(N)=O