Reaction Details
TargetKappa-type opioid receptor
LigandBDBM50123759
Substrate/Competitorn/a
Meas. Tech.ChEMBL_145988 (CHEMBL750582)
Ki 21±n/a nM
Citation Harrison, BAPasternak, GWVerdine, GL 2,6-Dimethyltyrosine analogues of a stereodiversified ligand library: highly potent, selective, non-peptidic mu opioid receptor agonists. J Med Chem46:677-80 (2003) 
 
Kappa-type opioid receptor
Name:Kappa-type opioid receptor
Type:G Protein-Coupled Receptor (GPCR)
Mol. Mass.:42744.99
Organism:Cavia porcellus (domestic guinea pig)
Description:P41144
Residue:380
BDBM50123759
NameBDBM50123759
Synonyms:(E)-(1S,2S,6R,7R)-7-((S)-1-Carbamoyl-2-phenyl-ethylcarbamoyl)-2,6-dihydroxy-1-(4-hydroxy-2,6-dimethyl-benzyl)-8-phenyl-oct-4-enyl-ammonium
TypeSmall organic molecule
Emp. Form.C33H42N3O5
Mol. Mass.560.7031
SMILESCc1cc(O)cc(C)c1C[C@H]([NH3+])[C@@H](O)C\C=C\[C@@H](O)[C@@H](Cc1ccccc1)C(=O)N[C@@H](Cc1ccccc1)C(N)=O