Reaction Details
TargetEstrogen receptor
LigandBDBM50126767
Substrate/Competitorn/a
Meas. Tech.ChEMBL_67167 (CHEMBL681151)
Ki 8.69±n/a nM
Citation Schmidt, JMMercure, JTremblay, GBPagé, MKalbakji, AFeher, MDunn-Dufault, RPeter, MGRedden, PR De novo design, synthesis, and evaluation of novel nonsteroidal phenanthrene ligands for the estrogen receptor. J Med Chem46:1408-18 (2003) 
 
Estrogen receptor
Name:Estrogen receptor
Type:Protein
Mol. Mass.:66230.44
Organism:Homo sapiens (Human)
Description:P03372
Residue:595
BDBM50126767
NameBDBM50126767
Synonyms:7-Ethyl-4-methyl-9-[4-(2-piperidin-1-yl-ethoxy)-phenyl]-9,10-dihydro-phenanthren-2-ol | CHEMBL30996
TypeSmall organic molecule
Emp. Form.C30H35NO2
Mol. Mass.441.6044
SMILESCCc1ccc-2c(c1)C(Cc1cc(O)cc(C)c-21)c1ccc(OCCN2CCCCC2)cc1