Reaction Details
TargetMalate dehydrogenase
LigandBDBM50111591
Substrate/Competitorn/a
Meas. Tech.ChEMBL_103875 (CHEMBL712992)
IC50 25000±n/a nM
Citation McGovern, SLShoichet, BK Kinase inhibitors: not just for kinases anymore. J Med Chem46:1478-83 (2003) 
 
Malate dehydrogenase
Name:Malate dehydrogenase
Type:PROTEIN
Mol. Mass.:35423.44
Organism:Thermus thermophilus
Description:ChEMBL_1448377
Residue:327
BDBM50111591
NameBDBM50111591
Synonyms:4-[2-(2,4-Difluoro-phenylamino)-thiazol-4-yl]-benzene-1,2-diol | CHEMBL34034
TypeSmall organic molecule
Emp. Form.C15H10F2N2O2S
Mol. Mass.320.314
SMILESOc1ccc(cc1O)-c1csc(Nc2ccc(F)cc2F)n1