Reaction Details
TargetMalate dehydrogenase
LigandBDBM50111604
Substrate/Competitorn/a
Meas. Tech.ChEMBL_103875 (CHEMBL712992)
IC50 120000±n/a nM
Citation McGovern, SLShoichet, BK Kinase inhibitors: not just for kinases anymore. J Med Chem46:1478-83 (2003) 
 
Malate dehydrogenase
Name:Malate dehydrogenase
Type:PROTEIN
Mol. Mass.:35423.44
Organism:Thermus thermophilus
Description:ChEMBL_1448377
Residue:327
BDBM50111604
NameBDBM50111604
Synonyms:3-[(4-Phenoxy-phenylamino)-methylene]-3H-isobenzofuran-1-one CHEMBL430923
TypeSmall organic molecule
Emp. Form.C21H15NO3
Mol. Mass.329.3487
SMILESOc1oc(\C=N\c2ccc(Oc3ccccc3)cc2)c2ccccc12