Reaction Details
TargetProstaglandin G/H synthase 1
LigandBDBM50108771
Substrate/Competitorn/a
Meas. Tech.ChEMBL_159576 (CHEMBL764775)
IC50 1000±n/a nM
Citation McGovern, SLShoichet, BK Kinase inhibitors: not just for kinases anymore. J Med Chem46:1478-83 (2003) 
 
Prostaglandin G/H synthase 1
Name:Prostaglandin G/H synthase 1
Type:Enzyme
Mol. Mass.:68692.62
Organism:Homo sapiens (Human)
Description:P23219
Residue:599
BDBM50108771
NameBDBM50108771
Synonyms:2'-amino-3'-methoxyflavone 2-(2-Amino-3-methoxy-phenyl)-chromen-4-one(PD98059) CHEMBL35482 | PD-98059
TypeSmall organic molecule
Emp. Form.C16H13NO3
Mol. Mass.267.2793
SMILESCOc1cccc(c1N)-c1cc(=O)c2ccccc2o1