Reaction Details
TargetChymotrypsinogen B
LigandBDBM2681
Substrate/Competitorn/a
Meas. Tech.ChEMBL_49607 (CHEMBL661258)
IC50 200000±n/a nM
Citation McGovern, SLShoichet, BK Kinase inhibitors: not just for kinases anymore. J Med Chem46:1478-83 (2003) 
 
Chymotrypsinogen B
Name:Chymotrypsinogen B
Type:PROTEIN
Mol. Mass.:27871.19
Organism:Homo sapiens (Human)
Description:ChEMBL_216634
Residue:263
BDBM2681
NameBDBM2681
Synonyms:3-{1-[3-(dimethylamino)propyl]-1H-indol-3-yl}-4-(1-methyl-1H-indol-3-yl)-2,5-dihydro-1H-pyrrole-2,5-dione CHEMBL268769
TypeSmall organic molecule
Emp. Form.C26H26N4O2
Mol. Mass.426.5102
SMILESCN(C)CCCn1cc(C2=C(C(=O)NC2=O)c2cn(C)c3ccccc23)c2ccccc12